{"text_format":"1","workbook":"xlsx","n_sheets":5,"sheets":["Berechnung","Info Grundschutz","Info Mobile Brandbelastung","Info Immobile Brandbelastung","Info Zusätzl. Löschw.Entn."],"not_rendered":{"charts":0,"images":1,"macros":1,"external_links":0,"defined_names":2,"comments":1,"pivot_tables":0},"unopened":[],"bounds":{"document_bytes":16777216,"sheet_cells":100000,"rows_first":2000,"rows_last":500,"rows_between":2000,"halvings":0,"cell_chars":16384,"cell_head_chars":4096},"cells_cut":0,"cells_raw":0,"read":"whole","date_system":"1900"}

{"sheet":"Berechnung","index":0,"n_rows":76,"n_cols":10,"rows_kept":76,"cut":false,"hidden":false,"merged":[[54,1,55,1],[66,2,71,2],[0,0,3,4],[5,0,7,4],[28,1,28,4],[8,2,8,4],[9,2,9,4],[45,4,46,4],[42,1,42,4],[52,1,52,4],[59,1,59,4],[4,0,4,4],[15,1,18,1],[56,1,57,1],[56,2,57,2],[75,2,75,4],[10,2,12,4],[73,2,73,4],[74,2,74,4],[56,3,57,3],[56,4,57,4],[54,3,55,3],[54,4,55,4],[54,2,55,2],[15,2,16,2]]}
[]
[]
[]
[]
["BRANDVERHÜTUNGSSTELLE"]
["Objektbezogene Löschwasserbedarfsermittlung gemäß TRVB F 137 (Ausgabe 2003)"]
[]
[]
[null,"Objekt:"]
[null,"Brandabschnitt:"]
[null,"Eingabefelder","Das Berechnungsblatt wurde von der Brandverhütungsstelle Burgenland erstellt. \nDieses Formblatt dient zur Berechnung des Löschwasserbedarfes für den Objektschutz. \nFür Berechnungsergebnisse wird keine Haftung übernommen.\n(Version 1.2)."]
[null,"Berechnet"]
[null,"Ergebnisse"]
[]
[null,"Erforderlicher Grundschutz gemäß Tabelle 1 (TRVB F 137)","Auswählen:",{"$f":"IFERROR(IF(C16=\"Bitte Auswahl treffen!\",\"\",VLOOKUP(C16,'Info Grundschutz'!A3:C7,3,0)),)","v":""},"l/min"]
[null,{"$f":"IF(C16=\"Bitte Auswahl treffen!\",\"\",VLOOKUP(C16,'Info Grundschutz'!A3:B7,2,0))","v":""},"Bitte Auswahl treffen!"]
["1.0"]
[]
[]
[null,"Erforderlicher Lieferdauer des Löschwassers gemäß Tabelle 1 (TRVB F 137)",null,{"$f":"IFERROR(IF(C16=\"Bitte Auswahl treffen!\",\"\",VLOOKUP(C16,'Info Grundschutz'!A3:E7,5,0)),\"\")","v":""},"Std."]
[null,"siehe Tabellenblatt \"Info Grundschutz\""]
[]
["2004-01-01","Tatsächlich vorhandener Löschwasserbedarf für den Grundschutz in l/min (Hydrant, ...)",null,null,"l/min"]
[null,"Tatsächlich vorhandener Löschwasserbedarf für den Grundschutz in m³ (Zisterne, ...) für 90 min",null,null,"m³"]
[null,"Summe tatsächlich vorhandener Löschwasserbedarf für den Grundschutz",null,{"$f":"IF(AND(D23=\"\",D24=\"\"),\"\",D23+D24*1000/90)","v":""},"l/min"]
[null,null,{"$f":"IF(C16=\"Bitte Auswahl treffen!\",\"\",IF(D25=\"\",\"\",IF(D26>=0,\"Ausreichend:\",\"Nicht Ausreichend:\")))","v":""},{"$f":"IF(C16=\"Bitte Auswahl treffen!\",\"\",IF(D25=\"\",\"\",D25-D15))","v":""},"l/min"]
["2019-02-01","Zusätzlich vorhandene Löschwasserentnahmestellen","Keine",null,{"$f":"IFERROR(IF(C27=\"Keine\",\"\",VLOOKUP(C27,Tabelle1[],2,0)),\"\")","v":""}]
[]
["2.0","Löschwasserbedarf für den Objektschutz"]
[]
[null,"Spezifische Löschwasserrate für die immobilen Brandbelastung"]
[]
["1900-01-02T02:24:00","Wände und Decke     nichtbrennbar      qLWi = 0,00     l/(m²min)","Auswählen:"]
[null,"Wände oder Decke    brennbar              qLWi = 0,50     l/(m²min)","Bitte Auswahl treffen!",{"$f":"IFERROR(IF(C34=\"Bitte Auswahl treffen!\",\"\",VLOOKUP(C34,'Info Immobile Brandbelastung'!A2:B5,2,0)),\"\")","v":""},"l/min"]
[null,"Wände und Decke     brennbar              qLWi = 1,00     l/(m²min)"]
[]
["2004-02-02","Spezifische Löschwasserrate für die mobile Brandbelastung und","Auswählen oder Textsuche:"]
[null,"Nutzung gemäß Anhang A ","Bitte Auswahl treffen!",{"$f":"IFERROR(IF(C38=\"Bitte Auswahl treffen!\",\"\",IF(C38=\"Sonstige\",\"\",VLOOKUP(C38,'Info Mobile Brandbelastung'!A2:B427,2,0))),\"\")","v":""},"l/min"]
[null,"siehe Tabellenblatt \"Info Mobile Brandbelastung\"",null,null,{"$f":"IF(C38=\"Sonstige\",\"l/min\",\"\")","v":""}]
[]
[null,"Brandabschnittsfläche (Berechnungsfläche)","AB",null," m²"]
[]
[null,"Rechnerische Brandfläche (AB = Brandabschnittsfläche)   Zutreffendes Ankreuzen (x)"]
[null,"Keine Brandschutzeinrichtung vorhanden Brandabschnittsfläche oder Gesamtnutzfläche (AB)  "]
[null,"Automatische Brandmeldeanlage gem. TRVB S 123 mit autom. Weiterleitung (AB = 2000 m²) "]
["3.0","Betriebsfeuerwehr mit ständigem Bereitschaftsdienst und autom. Brandmeldeanlage "]
[null,"gemäß TRVB S 123 (AB = 1200 m²) "]
[null,"Automatische Löschanlage mit automatischer Alarmweiterleitung (AB = 750 m²)"]
[]
[null,"Resultierende Brandabschnittsfläche","AB",{"$f":"IF(OR(E44=TRUE,E45=TRUE,E46=TRUE,E48=TRUE),IF(E48=TRUE,IF(D41>750,750,D41),IF(E46=TRUE,IF(D41>1200,1200,D41),IF(E45=TRUE,IF(D41>2000,2000,D41),D41))),\"\")","v":""}," m²"]
[]
[]
[null,"Löschwasserrate für den Objektschutz"]
[]
[null,"Lagerguthöhen ","hL",null," m"]
["4.0"]
[null,{"$f":"IF(D55>2.5,\"Löschwasserrate für den Objektschutz mit Lagerguthöhen über 2,50; QLWO = (qLWi + qLWM) . (AB + 4.(hL - 2,50).AB 0,5) \",\"Löschwasserrate für den Objektschutz mit Lagerguthöhen unter 2,50; QLWO = (qLWi + qLWM) l/m²(min) . AB m²\")","v":"Löschwasserrate für den Objektschutz mit Lagerguthöhen unter 2,50; QLWO = (qLWi + qLWM) l/m²(min) . AB m²"},"QLWO",{"$f":"IF(AND(D39=\"\",C38=\"Sonstige\"),\"\",IF(OR(E44=TRUE,E45=TRUE,E46=TRUE,E48=TRUE),IF(OR(C38=\"Bitte Auswahl treffen!\",C34=\"Bitte Auswahl treffen!\"),\"\",IF(C38=\"Sonstige\",IF(D55>2.5,(SUM(D34+D39)*(D50+4*(D55-2.5)*(D50^0.5))),SUM(D34+D39)*D50),IF(D55>2.5,(SUM(D34+D38)*(D50+4*(D55-2.5)*(D50^0.5))),SUM(D34+D38)*D50))),\"\"))","v":""},"l/min"]
[]
[]
[null,"Löschwasserbereitstellung "]
{"$rows_left_out":17}
{"sheet":"Info Grundschutz","index":1,"n_rows":7,"n_cols":11,"rows_kept":7,"cut":false,"hidden":false,"merged":[[0,7,0,10]]}
["Abkürzung","Bebauungsart","Löschwasserrate \nin l/min","Löschwasserrate \nin l/s","Lieferdauer \nmind. Std.","Löschwasservorrat\nin m³2",null,"Erforderliche Löschwasserrate in Abhängigkeit der maximalen Entfernung der Löschwasserentnahmestellen zum Objekt"]
["Bitte Auswahl treffen!",null,null,null,null,null,null,"bis 60 m\nl/min","bis 100 m\nl/min","bis 250 m\nl/min","bis 500 m\nl/min"]
["STREUSIEDLUNGEN","STREUSIEDLUNGEN (off. Bauw.): Ebenerdige\nBebauung (1 Geschoß); Einzelobj. bis\nmax. 150 m2 bebaute Fläche",800,13.3,1,50,null,"-",800,"-","-"]
["ORTSGEBIETE - bis höchst. 3 Gesch.","ORTSGEBIETE mit offener od. geschl. Bauw.\n- bis höchst. 3 Gesch.; landw. sowie gewerbl. Objekte, ohne besondere Brandgefahr",1600,26.7,2,200,null,"-",800,"weitere\n800","-"]
["ORTSGEBIETE- mehr als 3 Gesch.","ORTSGEBIETE  mit  offener  Bauweise,  mehr als 3 Gesch.; geschl. Bebauung in Wohnge- biet; gemischt genutzte Gebäude, ohne bes. Brandgefahr",2400,40,2,300,null,"-",800,"weitere\n800","weitere\n800"]
["BETRIEBS-,  INDUSTRIE,  HANDELS-  UND GEWERBEGEBIETE","BETRIEBS-,  INDUSTRIE,  HANDELS-  UND GEWERBEGEBIETE\nzusätzlich ist eine objektsbezogene Berech- nung gemäß Pkt. 5. erforderlich",3200,53.3,3,600,null,800,"-","weitere\n1200","weitere\n1200"]
["ALTSTADTGEBIETE und STADTZENTREN","ALTSTADTGEBIETE und STADTZENTREN",3200,53.3,3,600,null,800,"-","weitere\n1200","weitere\n1200"]

{"sheet":"Info Mobile Brandbelastung","index":2,"n_rows":427,"n_cols":3,"rows_kept":427,"cut":false,"hidden":false,"merged":[]}
["Nutzung","qLwm [l/(m²min)]","Dropdown"]
["Bitte Auswahl treffen!",null,{"$f":"IFERROR(IF(OR(EXACT(Berechnung!$C$38,Tabelle2[Nutzung])),Tabelle2[[#This Row],[Nutzung]],INDEX(Tabelle2[Nutzung],_xlfn.AGGREGATE(15,6,(ROW(Tabelle2[Nutzung])-1)/(--SEARCH(Berechnung!$C$38,Tabelle2[Nutzung])>0),ROW()-1),1)),\"\")","v":"Bitte Auswahl treffen!"}]
["Abstellraum für diverse Waren",1.8,{"$f":"IFERROR(IF(OR(EXACT(Berechnung!$C$38,Tabelle2[Nutzung])),Tabelle2[[#This Row],[Nutzung]],INDEX(Tabelle2[Nutzung],_xlfn.AGGREGATE(15,6,(ROW(Tabelle2[Nutzung])-1)/(--SEARCH(Berechnung!$C$38,Tabelle2[Nutzung])>0),ROW()-1),1)),\"\")","v":"Abstellraum für diverse Waren"}]
["Altersheim",1.6,{"$f":"IFERROR(IF(OR(EXACT(Berechnung!$C$38,Tabelle2[Nutzung])),Tabelle2[[#This Row],[Nutzung]],INDEX(Tabelle2[Nutzung],_xlfn.AGGREGATE(15,6,(ROW(Tabelle2[Nutzung])-1)/(--SEARCH(Berechnung!$C$38,Tabelle2[Nutzung])>0),ROW()-1),1)),\"\")","v":"Altersheim"}]
["Aluminium, Verarbeitung",3.6,{"$f":"IFERROR(IF(OR(EXACT(Berechnung!$C$38,Tabelle2[Nutzung])),Tabelle2[[#This Row],[Nutzung]],INDEX(Tabelle2[Nutzung],_xlfn.AGGREGATE(15,6,(ROW(Tabelle2[Nutzung])-1)/(--SEARCH(Berechnung!$C$38,Tabelle2[Nutzung])>0),ROW()-1),1)),\"\")","v":"Aluminium, Verarbeitung"}]
["Antiquitäten, Verkauf",1.5,{"$f":"IFERROR(IF(OR(EXACT(Berechnung!$C$38,Tabelle2[Nutzung])),Tabelle2[[#This Row],[Nutzung]],INDEX(Tabelle2[Nutzung],_xlfn.AGGREGATE(15,6,(ROW(Tabelle2[Nutzung])-1)/(--SEARCH(Berechnung!$C$38,Tabelle2[Nutzung])>0),ROW()-1),1)),\"\")","v":"Antiquitäten, Verkauf"}]
["Apotheke (inkl. Lager)",4.3,{"$f":"IFERROR(IF(OR(EXACT(Berechnung!$C$38,Tabelle2[Nutzung])),Tabelle2[[#This Row],[Nutzung]],INDEX(Tabelle2[Nutzung],_xlfn.AGGREGATE(15,6,(ROW(Tabelle2[Nutzung])-1)/(--SEARCH(Berechnung!$C$38,Tabelle2[Nutzung])>0),ROW()-1),1)),\"\")","v":"Apotheke (inkl. Lager)"}]
["Archiv",1.2,{"$f":"IFERROR(IF(OR(EXACT(Berechnung!$C$38,Tabelle2[Nutzung])),Tabelle2[[#This Row],[Nutzung]],INDEX(Tabelle2[Nutzung],_xlfn.AGGREGATE(15,6,(ROW(Tabelle2[Nutzung])-1)/(--SEARCH(Berechnung!$C$38,Tabelle2[Nutzung])>0),ROW()-1),1)),\"\")","v":"Archiv"}]
["Armaturen",1.8,{"$f":"IFERROR(IF(OR(EXACT(Berechnung!$C$38,Tabelle2[Nutzung])),Tabelle2[[#This Row],[Nutzung]],INDEX(Tabelle2[Nutzung],_xlfn.AGGREGATE(15,6,(ROW(Tabelle2[Nutzung])-1)/(--SEARCH(Berechnung!$C$38,Tabelle2[Nutzung])>0),ROW()-1),1)),\"\")","v":"Armaturen"}]
["Arzneimittel (Grobdurchschnitt)",2.8,{"$f":"IFERROR(IF(OR(EXACT(Berechnung!$C$38,Tabelle2[Nutzung])),Tabelle2[[#This Row],[Nutzung]],INDEX(Tabelle2[Nutzung],_xlfn.AGGREGATE(15,6,(ROW(Tabelle2[Nutzung])-1)/(--SEARCH(Berechnung!$C$38,Tabelle2[Nutzung])>0),ROW()-1),1)),\"\")","v":"Arzneimittel (Grobdurchschnitt)"}]
["Arztpraxis",2,{"$f":"IFERROR(IF(OR(EXACT(Berechnung!$C$38,Tabelle2[Nutzung])),Tabelle2[[#This Row],[Nutzung]],INDEX(Tabelle2[Nutzung],_xlfn.AGGREGATE(15,6,(ROW(Tabelle2[Nutzung])-1)/(--SEARCH(Berechnung!$C$38,Tabelle2[Nutzung])>0),ROW()-1),1)),\"\")","v":"Arztpraxis"}]
["Asbestwaren",0.6,{"$f":"IFERROR(IF(OR(EXACT(Berechnung!$C$38,Tabelle2[Nutzung])),Tabelle2[[#This Row],[Nutzung]],INDEX(Tabelle2[Nutzung],_xlfn.AGGREGATE(15,6,(ROW(Tabelle2[Nutzung])-1)/(--SEARCH(Berechnung!$C$38,Tabelle2[Nutzung])>0),ROW()-1),1)),\"\")","v":"Asbestwaren"}]
["Asphalt (in Fässern, Blöcken)",3.8,{"$f":"IFERROR(IF(OR(EXACT(Berechnung!$C$38,Tabelle2[Nutzung])),Tabelle2[[#This Row],[Nutzung]],INDEX(Tabelle2[Nutzung],_xlfn.AGGREGATE(15,6,(ROW(Tabelle2[Nutzung])-1)/(--SEARCH(Berechnung!$C$38,Tabelle2[Nutzung])>0),ROW()-1),1)),\"\")","v":"Asphalt (in Fässern, Blöcken)"}]
["Ausstellung, Auto",3,{"$f":"IFERROR(IF(OR(EXACT(Berechnung!$C$38,Tabelle2[Nutzung])),Tabelle2[[#This Row],[Nutzung]],INDEX(Tabelle2[Nutzung],_xlfn.AGGREGATE(15,6,(ROW(Tabelle2[Nutzung])-1)/(--SEARCH(Berechnung!$C$38,Tabelle2[Nutzung])>0),ROW()-1),1)),\"\")","v":"Ausstellung, Auto"}]
["Ausstellung, Gemälde",1.7,{"$f":"IFERROR(IF(OR(EXACT(Berechnung!$C$38,Tabelle2[Nutzung])),Tabelle2[[#This Row],[Nutzung]],INDEX(Tabelle2[Nutzung],_xlfn.AGGREGATE(15,6,(ROW(Tabelle2[Nutzung])-1)/(--SEARCH(Berechnung!$C$38,Tabelle2[Nutzung])>0),ROW()-1),1)),\"\")","v":"Ausstellung, Gemälde"}]
["Ausstellung, Maschinen",1,{"$f":"IFERROR(IF(OR(EXACT(Berechnung!$C$38,Tabelle2[Nutzung])),Tabelle2[[#This Row],[Nutzung]],INDEX(Tabelle2[Nutzung],_xlfn.AGGREGATE(15,6,(ROW(Tabelle2[Nutzung])-1)/(--SEARCH(Berechnung!$C$38,Tabelle2[Nutzung])>0),ROW()-1),1)),\"\")","v":"Ausstellung, Maschinen"}]
["Ausstellung, Möbel",1.6,{"$f":"IFERROR(IF(OR(EXACT(Berechnung!$C$38,Tabelle2[Nutzung])),Tabelle2[[#This Row],[Nutzung]],INDEX(Tabelle2[Nutzung],_xlfn.AGGREGATE(15,6,(ROW(Tabelle2[Nutzung])-1)/(--SEARCH(Berechnung!$C$38,Tabelle2[Nutzung])>0),ROW()-1),1)),\"\")","v":"Ausstellung, Möbel"}]
["Auto, Garagen",3,{"$f":"IFERROR(IF(OR(EXACT(Berechnung!$C$38,Tabelle2[Nutzung])),Tabelle2[[#This Row],[Nutzung]],INDEX(Tabelle2[Nutzung],_xlfn.AGGREGATE(15,6,(ROW(Tabelle2[Nutzung])-1)/(--SEARCH(Berechnung!$C$38,Tabelle2[Nutzung])>0),ROW()-1),1)),\"\")","v":"Auto, Garagen"}]
["Auto, Lackiererei",4,{"$f":"IFERROR(IF(OR(EXACT(Berechnung!$C$38,Tabelle2[Nutzung])),Tabelle2[[#This Row],[Nutzung]],INDEX(Tabelle2[Nutzung],_xlfn.AGGREGATE(15,6,(ROW(Tabelle2[Nutzung])-1)/(--SEARCH(Berechnung!$C$38,Tabelle2[Nutzung])>0),ROW()-1),1)),\"\")","v":"Auto, Lackiererei"}]
["Auto, Montage",2.1,{"$f":"IFERROR(IF(OR(EXACT(Berechnung!$C$38,Tabelle2[Nutzung])),Tabelle2[[#This Row],[Nutzung]],INDEX(Tabelle2[Nutzung],_xlfn.AGGREGATE(15,6,(ROW(Tabelle2[Nutzung])-1)/(--SEARCH(Berechnung!$C$38,Tabelle2[Nutzung])>0),ROW()-1),1)),\"\")","v":"Auto, Montage"}]
["Auto, Reparaturwerkstätte",2.5,{"$f":"IFERROR(IF(OR(EXACT(Berechnung!$C$38,Tabelle2[Nutzung])),Tabelle2[[#This Row],[Nutzung]],INDEX(Tabelle2[Nutzung],_xlfn.AGGREGATE(15,6,(ROW(Tabelle2[Nutzung])-1)/(--SEARCH(Berechnung!$C$38,Tabelle2[Nutzung])>0),ROW()-1),1)),\"\")","v":"Auto, Reparaturwerkstätte"}]
["Autozubehör",1.7,{"$f":"IFERROR(IF(OR(EXACT(Berechnung!$C$38,Tabelle2[Nutzung])),Tabelle2[[#This Row],[Nutzung]],INDEX(Tabelle2[Nutzung],_xlfn.AGGREGATE(15,6,(ROW(Tabelle2[Nutzung])-1)/(--SEARCH(Berechnung!$C$38,Tabelle2[Nutzung])>0),ROW()-1),1)),\"\")","v":"Autozubehör"}]
["Backwaren, Großbäckerei",1.8,{"$f":"IFERROR(IF(OR(EXACT(Berechnung!$C$38,Tabelle2[Nutzung])),Tabelle2[[#This Row],[Nutzung]],INDEX(Tabelle2[Nutzung],_xlfn.AGGREGATE(15,6,(ROW(Tabelle2[Nutzung])-1)/(--SEARCH(Berechnung!$C$38,Tabelle2[Nutzung])>0),ROW()-1),1)),\"\")","v":"Backwaren, Großbäckerei"}]
["Bank, Schalterhalle",1.6,{"$f":"IFERROR(IF(OR(EXACT(Berechnung!$C$38,Tabelle2[Nutzung])),Tabelle2[[#This Row],[Nutzung]],INDEX(Tabelle2[Nutzung],_xlfn.AGGREGATE(15,6,(ROW(Tabelle2[Nutzung])-1)/(--SEARCH(Berechnung!$C$38,Tabelle2[Nutzung])>0),ROW()-1),1)),\"\")","v":"Bank, Schalterhalle"}]
["Bastgewebe",0.6,{"$f":"IFERROR(IF(OR(EXACT(Berechnung!$C$38,Tabelle2[Nutzung])),Tabelle2[[#This Row],[Nutzung]],INDEX(Tabelle2[Nutzung],_xlfn.AGGREGATE(15,6,(ROW(Tabelle2[Nutzung])-1)/(--SEARCH(Berechnung!$C$38,Tabelle2[Nutzung])>0),ROW()-1),1)),\"\")","v":"Bastgewebe"}]
["Besen (H)",1.5,{"$f":"IFERROR(IF(OR(EXACT(Berechnung!$C$38,Tabelle2[Nutzung])),Tabelle2[[#This Row],[Nutzung]],INDEX(Tabelle2[Nutzung],_xlfn.AGGREGATE(15,6,(ROW(Tabelle2[Nutzung])-1)/(--SEARCH(Berechnung!$C$38,Tabelle2[Nutzung])>0),ROW()-1),1)),\"\")","v":"Besen (H)"}]
["Besteck",1,{"$f":"IFERROR(IF(OR(EXACT(Berechnung!$C$38,Tabelle2[Nutzung])),Tabelle2[[#This Row],[Nutzung]],INDEX(Tabelle2[Nutzung],_xlfn.AGGREGATE(15,6,(ROW(Tabelle2[Nutzung])-1)/(--SEARCH(Berechnung!$C$38,Tabelle2[Nutzung])>0),ROW()-1),1)),\"\")","v":"Besteck"}]
["Bettfedernreinigung",2.5,{"$f":"IFERROR(IF(OR(EXACT(Berechnung!$C$38,Tabelle2[Nutzung])),Tabelle2[[#This Row],[Nutzung]],INDEX(Tabelle2[Nutzung],_xlfn.AGGREGATE(15,6,(ROW(Tabelle2[Nutzung])-1)/(--SEARCH(Berechnung!$C$38,Tabelle2[Nutzung])>0),ROW()-1),1)),\"\")","v":"Bettfedernreinigung"}]
["Bibliothek",0.8,{"$f":"IFERROR(IF(OR(EXACT(Berechnung!$C$38,Tabelle2[Nutzung])),Tabelle2[[#This Row],[Nutzung]],INDEX(Tabelle2[Nutzung],_xlfn.AGGREGATE(15,6,(ROW(Tabelle2[Nutzung])-1)/(--SEARCH(Berechnung!$C$38,Tabelle2[Nutzung])>0),ROW()-1),1)),\"\")","v":"Bibliothek"}]
["Bijouteriewaren",1.6,{"$f":"IFERROR(IF(OR(EXACT(Berechnung!$C$38,Tabelle2[Nutzung])),Tabelle2[[#This Row],[Nutzung]],INDEX(Tabelle2[Nutzung],_xlfn.AGGREGATE(15,6,(ROW(Tabelle2[Nutzung])-1)/(--SEARCH(Berechnung!$C$38,Tabelle2[Nutzung])>0),ROW()-1),1)),\"\")","v":"Bijouteriewaren"}]
["Bijouteriewaren, Verkauf",1.5,{"$f":"IFERROR(IF(OR(EXACT(Berechnung!$C$38,Tabelle2[Nutzung])),Tabelle2[[#This Row],[Nutzung]],INDEX(Tabelle2[Nutzung],_xlfn.AGGREGATE(15,6,(ROW(Tabelle2[Nutzung])-1)/(--SEARCH(Berechnung!$C$38,Tabelle2[Nutzung])>0),ROW()-1),1)),\"\")","v":"Bijouteriewaren, Verkauf"}]
["Bilderrahmen",1.7,{"$f":"IFERROR(IF(OR(EXACT(Berechnung!$C$38,Tabelle2[Nutzung])),Tabelle2[[#This Row],[Nutzung]],INDEX(Tabelle2[Nutzung],_xlfn.AGGREGATE(15,6,(ROW(Tabelle2[Nutzung])-1)/(--SEARCH(Berechnung!$C$38,Tabelle2[Nutzung])>0),ROW()-1),1)),\"\")","v":"Bilderrahmen"}]
["Bitumenaufbereitung",3.8,{"$f":"IFERROR(IF(OR(EXACT(Berechnung!$C$38,Tabelle2[Nutzung])),Tabelle2[[#This Row],[Nutzung]],INDEX(Tabelle2[Nutzung],_xlfn.AGGREGATE(15,6,(ROW(Tabelle2[Nutzung])-1)/(--SEARCH(Berechnung!$C$38,Tabelle2[Nutzung])>0),ROW()-1),1)),\"\")","v":"Bitumenaufbereitung"}]
["Blech, Blechwaren",1.1000000000000001,{"$f":"IFERROR(IF(OR(EXACT(Berechnung!$C$38,Tabelle2[Nutzung])),Tabelle2[[#This Row],[Nutzung]],INDEX(Tabelle2[Nutzung],_xlfn.AGGREGATE(15,6,(ROW(Tabelle2[Nutzung])-1)/(--SEARCH(Berechnung!$C$38,Tabelle2[Nutzung])>0),ROW()-1),1)),\"\")","v":"Blech, Blechwaren"}]
["Blechwaren, Auslieferung",1.1000000000000001,{"$f":"IFERROR(IF(OR(EXACT(Berechnung!$C$38,Tabelle2[Nutzung])),Tabelle2[[#This Row],[Nutzung]],INDEX(Tabelle2[Nutzung],_xlfn.AGGREGATE(15,6,(ROW(Tabelle2[Nutzung])-1)/(--SEARCH(Berechnung!$C$38,Tabelle2[Nutzung])>0),ROW()-1),1)),\"\")","v":"Blechwaren, Auslieferung"}]
["Bleistifte (H)",2.1,{"$f":"IFERROR(IF(OR(EXACT(Berechnung!$C$38,Tabelle2[Nutzung])),Tabelle2[[#This Row],[Nutzung]],INDEX(Tabelle2[Nutzung],_xlfn.AGGREGATE(15,6,(ROW(Tabelle2[Nutzung])-1)/(--SEARCH(Berechnung!$C$38,Tabelle2[Nutzung])>0),ROW()-1),1)),\"\")","v":"Bleistifte (H)"}]
["Bodenbeläge, brennbare (H)",2,{"$f":"IFERROR(IF(OR(EXACT(Berechnung!$C$38,Tabelle2[Nutzung])),Tabelle2[[#This Row],[Nutzung]],INDEX(Tabelle2[Nutzung],_xlfn.AGGREGATE(15,6,(ROW(Tabelle2[Nutzung])-1)/(--SEARCH(Berechnung!$C$38,Tabelle2[Nutzung])>0),ROW()-1),1)),\"\")","v":"Bodenbeläge, brennbare (H)"}]
["Bodenbeläge, Verkauf",1.5,{"$f":"IFERROR(IF(OR(EXACT(Berechnung!$C$38,Tabelle2[Nutzung])),Tabelle2[[#This Row],[Nutzung]],INDEX(Tabelle2[Nutzung],_xlfn.AGGREGATE(15,6,(ROW(Tabelle2[Nutzung])-1)/(--SEARCH(Berechnung!$C$38,Tabelle2[Nutzung])>0),ROW()-1),1)),\"\")","v":"Bodenbeläge, Verkauf"}]
["Bodenpflegemittel (H)",4.5,{"$f":"IFERROR(IF(OR(EXACT(Berechnung!$C$38,Tabelle2[Nutzung])),Tabelle2[[#This Row],[Nutzung]],INDEX(Tabelle2[Nutzung],_xlfn.AGGREGATE(15,6,(ROW(Tabelle2[Nutzung])-1)/(--SEARCH(Berechnung!$C$38,Tabelle2[Nutzung])>0),ROW()-1),1)),\"\")","v":"Bodenpflegemittel (H)"}]
["Bonbons (H)",3.9,{"$f":"IFERROR(IF(OR(EXACT(Berechnung!$C$38,Tabelle2[Nutzung])),Tabelle2[[#This Row],[Nutzung]],INDEX(Tabelle2[Nutzung],_xlfn.AGGREGATE(15,6,(ROW(Tabelle2[Nutzung])-1)/(--SEARCH(Berechnung!$C$38,Tabelle2[Nutzung])>0),ROW()-1),1)),\"\")","v":"Bonbons (H)"}]
["Bonbons, Wicklerei, Verpackung",3.2,{"$f":"IFERROR(IF(OR(EXACT(Berechnung!$C$38,Tabelle2[Nutzung])),Tabelle2[[#This Row],[Nutzung]],INDEX(Tabelle2[Nutzung],_xlfn.AGGREGATE(15,6,(ROW(Tabelle2[Nutzung])-1)/(--SEARCH(Berechnung!$C$38,Tabelle2[Nutzung])>0),ROW()-1),1)),\"\")","v":"Bonbons, Wicklerei, Verpackung"}]
["Boote, Holz (H)",1.6,{"$f":"IFERROR(IF(OR(EXACT(Berechnung!$C$38,Tabelle2[Nutzung])),Tabelle2[[#This Row],[Nutzung]],INDEX(Tabelle2[Nutzung],_xlfn.AGGREGATE(15,6,(ROW(Tabelle2[Nutzung])-1)/(--SEARCH(Berechnung!$C$38,Tabelle2[Nutzung])>0),ROW()-1),1)),\"\")","v":"Boote, Holz (H)"}]
["Boote, Kunststoff (H)",2.5,{"$f":"IFERROR(IF(OR(EXACT(Berechnung!$C$38,Tabelle2[Nutzung])),Tabelle2[[#This Row],[Nutzung]],INDEX(Tabelle2[Nutzung],_xlfn.AGGREGATE(15,6,(ROW(Tabelle2[Nutzung])-1)/(--SEARCH(Berechnung!$C$38,Tabelle2[Nutzung])>0),ROW()-1),1)),\"\")","v":"Boote, Kunststoff (H)"}]
["Brauerei",1.7,{"$f":"IFERROR(IF(OR(EXACT(Berechnung!$C$38,Tabelle2[Nutzung])),Tabelle2[[#This Row],[Nutzung]],INDEX(Tabelle2[Nutzung],_xlfn.AGGREGATE(15,6,(ROW(Tabelle2[Nutzung])-1)/(--SEARCH(Berechnung!$C$38,Tabelle2[Nutzung])>0),ROW()-1),1)),\"\")","v":"Brauerei"}]
["Buchbinderei",1.4,{"$f":"IFERROR(IF(OR(EXACT(Berechnung!$C$38,Tabelle2[Nutzung])),Tabelle2[[#This Row],[Nutzung]],INDEX(Tabelle2[Nutzung],_xlfn.AGGREGATE(15,6,(ROW(Tabelle2[Nutzung])-1)/(--SEARCH(Berechnung!$C$38,Tabelle2[Nutzung])>0),ROW()-1),1)),\"\")","v":"Buchbinderei"}]
["Bücher",0.8,{"$f":"IFERROR(IF(OR(EXACT(Berechnung!$C$38,Tabelle2[Nutzung])),Tabelle2[[#This Row],[Nutzung]],INDEX(Tabelle2[Nutzung],_xlfn.AGGREGATE(15,6,(ROW(Tabelle2[Nutzung])-1)/(--SEARCH(Berechnung!$C$38,Tabelle2[Nutzung])>0),ROW()-1),1)),\"\")","v":"Bücher"}]
["Bücher, Verkauf",1.2,{"$f":"IFERROR(IF(OR(EXACT(Berechnung!$C$38,Tabelle2[Nutzung])),Tabelle2[[#This Row],[Nutzung]],INDEX(Tabelle2[Nutzung],_xlfn.AGGREGATE(15,6,(ROW(Tabelle2[Nutzung])-1)/(--SEARCH(Berechnung!$C$38,Tabelle2[Nutzung])>0),ROW()-1),1)),\"\")","v":"Bücher, Verkauf"}]
["Büro",1.4,{"$f":"IFERROR(IF(OR(EXACT(Berechnung!$C$38,Tabelle2[Nutzung])),Tabelle2[[#This Row],[Nutzung]],INDEX(Tabelle2[Nutzung],_xlfn.AGGREGATE(15,6,(ROW(Tabelle2[Nutzung])-1)/(--SEARCH(Berechnung!$C$38,Tabelle2[Nutzung])>0),ROW()-1),1)),\"\")","v":"Büro"}]
["Büromaschinen (H)",1.7,{"$f":"IFERROR(IF(OR(EXACT(Berechnung!$C$38,Tabelle2[Nutzung])),Tabelle2[[#This Row],[Nutzung]],INDEX(Tabelle2[Nutzung],_xlfn.AGGREGATE(15,6,(ROW(Tabelle2[Nutzung])-1)/(--SEARCH(Berechnung!$C$38,Tabelle2[Nutzung])>0),ROW()-1),1)),\"\")","v":"Büromaschinen (H)"}]
["Büromaschinen, Verkauf",1.7,{"$f":"IFERROR(IF(OR(EXACT(Berechnung!$C$38,Tabelle2[Nutzung])),Tabelle2[[#This Row],[Nutzung]],INDEX(Tabelle2[Nutzung],_xlfn.AGGREGATE(15,6,(ROW(Tabelle2[Nutzung])-1)/(--SEARCH(Berechnung!$C$38,Tabelle2[Nutzung])>0),ROW()-1),1)),\"\")","v":"Büromaschinen, Verkauf"}]
["Büromaterial",1.4,{"$f":"IFERROR(IF(OR(EXACT(Berechnung!$C$38,Tabelle2[Nutzung])),Tabelle2[[#This Row],[Nutzung]],INDEX(Tabelle2[Nutzung],_xlfn.AGGREGATE(15,6,(ROW(Tabelle2[Nutzung])-1)/(--SEARCH(Berechnung!$C$38,Tabelle2[Nutzung])>0),ROW()-1),1)),\"\")","v":"Büromaterial"}]
["Bürstenwaren (H)",1.7,{"$f":"IFERROR(IF(OR(EXACT(Berechnung!$C$38,Tabelle2[Nutzung])),Tabelle2[[#This Row],[Nutzung]],INDEX(Tabelle2[Nutzung],_xlfn.AGGREGATE(15,6,(ROW(Tabelle2[Nutzung])-1)/(--SEARCH(Berechnung!$C$38,Tabelle2[Nutzung])>0),ROW()-1),1)),\"\")","v":"Bürstenwaren (H)"}]
["Celluloid (H)",9,{"$f":"IFERROR(IF(OR(EXACT(Berechnung!$C$38,Tabelle2[Nutzung])),Tabelle2[[#This Row],[Nutzung]],INDEX(Tabelle2[Nutzung],_xlfn.AGGREGATE(15,6,(ROW(Tabelle2[Nutzung])-1)/(--SEARCH(Berechnung!$C$38,Tabelle2[Nutzung])>0),ROW()-1),1)),\"\")","v":"Celluloid (H)"}]
["Chemische Reinigung",3,{"$f":"IFERROR(IF(OR(EXACT(Berechnung!$C$38,Tabelle2[Nutzung])),Tabelle2[[#This Row],[Nutzung]],INDEX(Tabelle2[Nutzung],_xlfn.AGGREGATE(15,6,(ROW(Tabelle2[Nutzung])-1)/(--SEARCH(Berechnung!$C$38,Tabelle2[Nutzung])>0),ROW()-1),1)),\"\")","v":"Chemische Reinigung"}]
["Dachpappe (H)",2.1,{"$f":"IFERROR(IF(OR(EXACT(Berechnung!$C$38,Tabelle2[Nutzung])),Tabelle2[[#This Row],[Nutzung]],INDEX(Tabelle2[Nutzung],_xlfn.AGGREGATE(15,6,(ROW(Tabelle2[Nutzung])-1)/(--SEARCH(Berechnung!$C$38,Tabelle2[Nutzung])>0),ROW()-1),1)),\"\")","v":"Dachpappe (H)"}]
["Datenverarbeitung",1.5,{"$f":"IFERROR(IF(OR(EXACT(Berechnung!$C$38,Tabelle2[Nutzung])),Tabelle2[[#This Row],[Nutzung]],INDEX(Tabelle2[Nutzung],_xlfn.AGGREGATE(15,6,(ROW(Tabelle2[Nutzung])-1)/(--SEARCH(Berechnung!$C$38,Tabelle2[Nutzung])>0),ROW()-1),1)),\"\")","v":"Datenverarbeitung"}]
["Dispersionsfarben (H)",3,{"$f":"IFERROR(IF(OR(EXACT(Berechnung!$C$38,Tabelle2[Nutzung])),Tabelle2[[#This Row],[Nutzung]],INDEX(Tabelle2[Nutzung],_xlfn.AGGREGATE(15,6,(ROW(Tabelle2[Nutzung])-1)/(--SEARCH(Berechnung!$C$38,Tabelle2[Nutzung])>0),ROW()-1),1)),\"\")","v":"Dispersionsfarben (H)"}]
["Draht (isoliert) (H)",1.5,{"$f":"IFERROR(IF(OR(EXACT(Berechnung!$C$38,Tabelle2[Nutzung])),Tabelle2[[#This Row],[Nutzung]],INDEX(Tabelle2[Nutzung],_xlfn.AGGREGATE(15,6,(ROW(Tabelle2[Nutzung])-1)/(--SEARCH(Berechnung!$C$38,Tabelle2[Nutzung])>0),ROW()-1),1)),\"\")","v":"Draht (isoliert) (H)"}]
["Drogeriewaren, Verkauf",3.3,{"$f":"IFERROR(IF(OR(EXACT(Berechnung!$C$38,Tabelle2[Nutzung])),Tabelle2[[#This Row],[Nutzung]],INDEX(Tabelle2[Nutzung],_xlfn.AGGREGATE(15,6,(ROW(Tabelle2[Nutzung])-1)/(--SEARCH(Berechnung!$C$38,Tabelle2[Nutzung])>0),ROW()-1),1)),\"\")","v":"Drogeriewaren, Verkauf"}]
["Druckfarben (H)",3.3,{"$f":"IFERROR(IF(OR(EXACT(Berechnung!$C$38,Tabelle2[Nutzung])),Tabelle2[[#This Row],[Nutzung]],INDEX(Tabelle2[Nutzung],_xlfn.AGGREGATE(15,6,(ROW(Tabelle2[Nutzung])-1)/(--SEARCH(Berechnung!$C$38,Tabelle2[Nutzung])>0),ROW()-1),1)),\"\")","v":"Druckfarben (H)"}]
{"$rows_left_out":368}
{"sheet":"Info Immobile Brandbelastung","index":3,"n_rows":5,"n_cols":2,"rows_kept":5,"cut":false,"hidden":false,"merged":[]}
["Beschreibung","qLWi in l/(m²min)"]
["Bitte Auswahl treffen!"]
["Wände und Decke nicht brennbar  ",0]
["Wände oder Decke brennbar",0.5]
["Wände und Decke brennbar",1]

{"sheet":"Info Zusätzl. Löschw.Entn.","index":4,"n_rows":6,"n_cols":2,"rows_kept":6,"cut":false,"hidden":false,"merged":[]}
["Beschreibung","Einheit"]
["Keine"]
["Löschteich oder offener Löschwasserbehälter ","m³"]
["Gedeckter Löschwasserbehälter ","m³"]
["Bach oder Fluss mit vorbereiteter Saugstelle ","l/min"]
["Brunnen ","l/min"]